Target
TGF-beta receptor type-1 [4-503,T204D]
Ligand
BDBM21492
Substrate
TGF-beta receptor type I
Meas. Tech.
Enzyme Assay and Luciferase Reporter Assay
pH
7.5±n/a
Temperature
303.15±n/a K
IC50
59±23 nM
EC50
40±22 nM
Citation
 Li, HYMcMillen, WTHeap, CRMcCann, DJYan, LCampbell, RMMundla, SRKing, CHDierks, EAAnderson, BDBritt, KSHuss, KLVoss, MDWang, YClawson, DKYingling, JMSawyer, JS Optimization of a Dihydropyrrolopyrazole Series of Transforming Growth Factor-beta Type I Receptor Kinase Domain Inhibitors: Discovery of an Orally Bioavailable Transforming Growth Factor-beta Receptor Type I Inhibitor as Antitumor Agent. J Med Chem 51:2302-2306 (2008)  
Target
Name:
TGF-beta receptor type-1 [4-503,T204D]
Synonyms:
ALK5 TGF-beta receptor type-1 T204D TGFR-1 T204D | TGFR1_HUMAN
Type:
Enzyme Catalytic Domain
Mol. Mass.:
55650.84
Organism:
Homo sapiens (Human)
Description:
P36897 T204D
Residue:
500
  
Inhibitor
Name:
BDBM21492
Synonyms:
4-[3-(pyridin-2-yl)-1H-pyrazol-4-yl]quinoline LY364947 US9138393, LY-364947 | US9144538, LY-364947
Type:
Small organic molecule
Emp. Form.:
C17H12N4
Mol. Mass.:
272.304
SMILES:
c1[nH]nc(c1-c1ccnc2ccccc12)-c1ccccn1
:
Substrate
Name:
TGF-beta receptor type I
Synonyms:
ALK5 SKR4 TGFR1_HUMAN
Type:
Receptor intracellular domain
Mol. Mass.:
40581.62
Organism:
Homo sapiens (Human)
Description:
The autophosphorylation substrate.
Residue:
356