Target
Potassium voltage-gated channel subfamily H member 2
Ligand
BDBM29999
Substrate
BDBM24064
Meas. Tech.
In Vitro Binding Assay (IC50) and In Vitro Agonism/Antagonism Measurements (EC50/IC50)
IC50
>10000±n/a nM
Citation
 Kobayashi, KKato, TYamamoto, IShimizu, AMizutani, SAsai, MKawamoto, HIto, SYoshizumi, THirayama, MOzaki, SOhta, HOkamoto, O Optimization of benzimidazole series as opioid receptor-like 1 (ORL1) antagonists: SAR study directed toward improvement of selectivity over hERG activity. Bioorg Med Chem Lett 19:3100-3 (2009)  
Target
Name:
Potassium voltage-gated channel subfamily H member 2
Synonyms:
1,3-beta-glucan synthase component GLS2 ERG Eag-related protein 1 Ether-a-go-go-related gene (HERG) Ether-a-go-go-related gene potassium channel 1 Ether-a-go-go-related gene potassium channel 1 (hERG1) Ether-a-go-go-related protein 1 H-ERG KCNH2 Potassium voltage-gated channel subfamily H member 2 (hERG) Voltage-gated potassium channel subunit Kv11.1 hERG Potassium Channel 1 | putative potassium channel subunit
Type:
Multi-pass membrane protein
Mol. Mass.:
126672.65
Organism:
Homo sapiens (Human)
Description:
Q12809
Residue:
1159
  
Inhibitor
Name:
BDBM29999
Synonyms:
benzimidazole analogue, 5d
Type:
Small organic molecule
Emp. Form.:
C18H24ClN5S
Mol. Mass.:
377.935
SMILES:
C[C@@H]1CN(CC#N)CCN1c1cc2[nH]c(SC(C)(C)C)nc2cc1Cl
:
Substrate
Name:
BDBM24064
Synonyms:
L-706,000 MK-499 [35S]-MK499
Type:
radiolabeled ligand
Emp. Form.:
C25H29N3O4S
Mol. Mass.:
467.58
SMILES:
CS(=O)(=O)Nc1ccc2OC3(CCN(CC3)[C@@H]3CCc4cc(ccc4C3)C#N)C[C@@H](O)c2c1
: