Target
Adenosine receptor A1
Ligand
BDBM35810
Substrate
BDBM10852
Meas. Tech.
Radioligand Binding Assay
Ki
94±n/a nM
Citation
 Gillespie, RJBamford, SJClay, AGaur, SHaymes, TJackson, PSJordan, AMKlenke, BLeonardi, SLiu, JMansell, HLNg, SSaadi, MSimmonite, HStratton, GCTodd, RSWilliamson, DSYule, IA Antagonists of the human A(2A) receptor. Part 6: Further optimization of pyrimidine-4-carboxamides. Bioorg Med Chem 17:6590-605 (2009)  
Target
Name:
Adenosine receptor A1
Synonyms:
A1 adenosine receptor (hA1) AA1R_HUMAN ADORA1 Adenosine A1-receptor Adenosine receptor A1 (hA1) | Adenosine transporter (AdT)
Type:
G Protein-Coupled Receptor (GPCR)
Mol. Mass.:
36520.92
Organism:
Homo sapiens (Human)
Description:
P30542
Residue:
326
  
Inhibitor
Name:
BDBM35810
Synonyms:
pyrimidine-4-carboxamide, 70
Type:
Small organic molecule
Emp. Form.:
C19H19N5O
Mol. Mass.:
333.3871
SMILES:
Cc1cccc(c1)-c1cc(nc(N)n1)C(=O)NCc1ncccc1C
:
Substrate