Target
Adenosine receptor A2a
Ligand
BDBM35839
Substrate
BDBM35804
Meas. Tech.
Radioligand Binding Assay
Ki
5.5±n/a nM
Citation
 Gillespie, RJBamford, SJClay, AGaur, SHaymes, TJackson, PSJordan, AMKlenke, BLeonardi, SLiu, JMansell, HLNg, SSaadi, MSimmonite, HStratton, GCTodd, RSWilliamson, DSYule, IA Antagonists of the human A(2A) receptor. Part 6: Further optimization of pyrimidine-4-carboxamides. Bioorg Med Chem 17:6590-605 (2009)  
Target
Name:
Adenosine receptor A2a
Synonyms:
A2A adenosine receptor (hA2A) ADENOSINE A2 ADORA2 Adenosine A2A receptor (A2AAR)
Type:
G Protein-Coupled Receptor (GPCR)
Mol. Mass.:
44716.46
Organism:
Homo sapiens (Human)
Description:
P29274
Residue:
412
  
Inhibitor
Name:
BDBM35839
Synonyms:
pyrimidine-4-carboxamide, 121
Type:
Small organic molecule
Emp. Form.:
C17H20N6O2
Mol. Mass.:
340.3797
SMILES:
CC(C)n1ccnc1CNC(=O)c1cc(nc(N)n1)-c1ccc(C)o1
:
Substrate
Name:
BDBM35804
Synonyms:
(CGS21680) 3-(4-{2-[6-Amino-9-(5-ethylcarbamoylmethyl-3,4-dihydroxy-tetrahydro-furan-2-yl)-9H-purin-2-ylamino]-ethyl}-phenyl)-propionic acid 2-[4-(2-carboxyethyl)phenethylamino]-5''''-N-ethylcarboxamidoadenosine 3-(4-(2-(6-amino-9-((2R,3R,4S,5S)-5-(ethylcarbamoyl)-3,4-dihydroxy-tetrahydrofuran-2-yl)-9H-purin-2-ylamino)ethyl)phenyl)propanoic acid 3-(4-{2-[6-Amino-9-((2R,3R,4S,5S)-5-ethylcarbamoyl-3,4-dihydroxy-tetrahydro-furan-2-yl)-9H-purin-2-ylamino]-ethyl}-phenyl)-propionic acid CGS-21680 [3H]-CGS 21680
Type:
radiolabeled ligand
Emp. Form.:
C23H29N7O6
Mol. Mass.:
499.5197
SMILES:
CCNC(=O)[C@H]1O[C@H]([C@H](O)[C@@H]1O)n1cnc2c(N)nc(NCCc3ccc(CCC(O)=O)cc3)nc12
: