Target
Adenosine receptor A3
Ligand
BDBM35829
Substrate
BDBM10852
Meas. Tech.
Radioligand Binding Assay
Ki
366±n/a nM
Citation
 Gillespie, RJBamford, SJClay, AGaur, SHaymes, TJackson, PSJordan, AMKlenke, BLeonardi, SLiu, JMansell, HLNg, SSaadi, MSimmonite, HStratton, GCTodd, RSWilliamson, DSYule, IA Antagonists of the human A(2A) receptor. Part 6: Further optimization of pyrimidine-4-carboxamides. Bioorg Med Chem 17:6590-605 (2009)  
Target
Name:
Adenosine receptor A3
Synonyms:
A3 adenosine receptor (hA3) ADORA3 | Adenosine A3 receptor (A3AR)
Type:
G Protein-Coupled Receptor (GPCR)
Mol. Mass.:
36197.32
Organism:
Homo sapiens (Human)
Description:
P0DMS8
Residue:
318
  
Inhibitor
Name:
BDBM35829
Synonyms:
pyrimidine-4-carboxamide, 111
Type:
Small organic molecule
Emp. Form.:
C17H17N5O2
Mol. Mass.:
323.3492
SMILES:
Cc1ccc(o1)-c1cc(nc(N)n1)C(=O)NCc1cccc(C)n1
:
Substrate