Target
Coagulation factor VIII
Ligand
BDBM59154
Substrate
Meas. Tech.
Inhibition Assay
pH
8±0
IC50
1.04e+4± 1.30e+3 nM
Citation
 Spiegel, PCKaiser, SMSimon, JAStoddard, BL Disruption of protein-membrane binding and identification of small-molecule inhibitors of coagulation factor VIII. Chem Biol 11:1413-22 (2004)  
Target
Name:
Coagulation factor VIII
Synonyms:
AHF F8 FA8_HUMAN Factor VIII B chain Factor VIIIa heavy chain, 92 kDa isoform Procoagulant component
Type:
Protein
Mol. Mass.:
267036.98
Organism:
Homo sapiens (Human)
Description:
P00451
Residue:
2351
  
Inhibitor
Name:
BDBM59154
Synonyms:
5739991
Type:
Small organic molecule
Emp. Form.:
C14H7BrN2O4S2
Mol. Mass.:
411.25
SMILES:
[O-][N+](=O)c1ccc(cc1)N1C(=S)S\C(=C/c2ccc(Br)o2)C1=O
: