Target
Protein kinase C alpha type
Ligand
BDBM3020
Substrate
Protamine Sulfate
Meas. Tech.
Kinase Inhibition Assay
IC50
>100000±n/a nM
Citation
 Traxler, PBold, GFrei, JLang, MLydon, NMett, HBuchdunger, EMeyer, TMueller, MFuret, P Use of a pharmacophore model for the design of EGF-R tyrosine kinase inhibitors: 4-(phenylamino)pyrazolo[3,4-d]pyrimidines. J Med Chem 40:3601-16 (1997)  
Target
Name:
Protein kinase C alpha type
Synonyms:
KPCA_BOVIN PRKCA Protein kinase C alpha
Type:
Enzyme
Mol. Mass.:
76842.76
Organism:
Bos taurus (bovine)
Description:
Residue:
672
  
Inhibitor
Name:
BDBM3020
Synonyms:
3-((3-Methoxybenzyl)amino)-4-((3-chlorophenyl)amino)-1H-pyrazolo[3,4-d]pyrimidine 4-N-(3-chlorophenyl)-3-N-[(3-methoxyphenyl)methyl]-1H-pyrazolo[3,4-d]pyrimidine-3,4-diamine
Type:
Small organic molecule
Emp. Form.:
C19H17ClN6O
Mol. Mass.:
380.831
SMILES:
COc1cccc(CNc2[nH]nc3ncnc(Nc4cccc(Cl)c4)c23)c1
:
Substrate
Name:
Protamine Sulfate
Synonyms:
Type:
Other Protein Type
Mol. Mass.:
358.43
Organism:
Description:
A purified mixture of simple protein obtained from the sperm or testes of suitable species of fish.
Residue:
3
NA