Target
Protein kinase C alpha type
Ligand
BDBM3027
Substrate
Protamine Sulfate
Meas. Tech.
Kinase Inhibition Assay
IC50
1500±n/a nM
Citation
 Traxler, PBold, GFrei, JLang, MLydon, NMett, HBuchdunger, EMeyer, TMueller, MFuret, P Use of a pharmacophore model for the design of EGF-R tyrosine kinase inhibitors: 4-(phenylamino)pyrazolo[3,4-d]pyrimidines. J Med Chem 40:3601-16 (1997)  
Target
Name:
Protein kinase C alpha type
Synonyms:
KPCA_BOVIN PRKCA Protein kinase C alpha
Type:
Enzyme
Mol. Mass.:
76842.76
Organism:
Bos taurus (bovine)
Description:
Residue:
672
  
Inhibitor
Name:
BDBM3027
Synonyms:
3-(3-Aminophenyl)-4-((3-chlorophenyl)amino)-1H-pyrazolo[3,4-d]pyrimidine 4-(Phenylamino)pyrazolo[3,4-d]pyrimidine deriv. 28
Type:
Small organic molecule
Emp. Form.:
C17H13ClN6
Mol. Mass.:
336.778
SMILES:
Nc1cccc(c1)-c1[nH]nc2ncnc(Nc3cccc(Cl)c3)c12
:
Substrate
Name:
Protamine Sulfate
Synonyms:
Type:
Other Protein Type
Mol. Mass.:
358.43
Organism:
Description:
A purified mixture of simple protein obtained from the sperm or testes of suitable species of fish.
Residue:
3
NA