Target
Epidermal growth factor receptor
Ligand
BDBM3074
Substrate
Poly(E:Y)
Meas. Tech.
Kinase Inhibition Assay
IC50
1300±n/a nM
Citation
 Klutchko, SRHamby, JMBoschelli, DHWu, ZKraker, AJAmar, AMHartl, BGShen, CKlohs, WDSteinkampf, RWDriscoll, DLNelson, JMElliott, WLRoberts, BJStoner, CLVincent, PWDykes, DJPanek, RLLu, GHMajor, TCDahring, TKHallak, HBradford, LAShowalter, HDDoherty, AM 2-Substituted aminopyrido[2,3-d]pyrimidin-7(8H)-ones. structure-activity relationships against selected tyrosine kinases and in vitro and in vivo anticancer activity. J Med Chem 41:3276-92 (1998)  
Target
Name:
Epidermal growth factor receptor
Synonyms:
EGF Receptor Substrate EGFR_HUMAN ERBB1 Epidermal Growth Factor Receptor erbB-1 Epidermal growth factor receptor (EGFR) HER1 Proto-oncogene c-ErbB-1 Tyrosine-Protein Kinase ErbB-1
Type:
Receptor Kinase Domain
Mol. Mass.:
134279.59
Organism:
Homo sapiens (Human)
Description:
P00533
Residue:
1210
  
Inhibitor
Name:
BDBM3074
Synonyms:
2-aminopyrido[2,3-d]pyrimidin-7(8H)-one 41 PD 166285 analog
Type:
Small organic molecule
Emp. Form.:
C20H15Cl2N5O2
Mol. Mass.:
428.271
SMILES:
COc1ccc(Nc2ncc3cc(-c4c(Cl)cccc4Cl)c(=O)n(C)c3n2)cn1
:
Substrate
Name:
Poly(E:Y)
Synonyms:
Type:
Random polymer
Mol. Mass.:
358.43
Organism:
Description:
Random copolymer of glutamic acid and tyrosine (4:1). 50 uM ATP containing 0.4 uCi of [gamma-32P]ATP as co-substrate
Residue:
3
NA