Target
Sucrase-isomaltase, intestinal
Ligand
BDBM50031480
Substrate
Meas. Tech.
ChEMBL_206287 (CHEMBL808824)
IC50
70000±n/a nM
Citation
 Asano, NKizu, HOseki, KTomioka, EMatsui, KOkamoto, MBaba, M N-alkylated nitrogen-in-the-ring sugars: conformational basis of inhibition of glycosidases and HIV-1 replication. J Med Chem 38:2349-56 (1995)  
Target
Name:
Sucrase-isomaltase, intestinal
Synonyms:
SUIS_RAT Sucrase-isomaltase | alpha-Glucosidase (α-Glucosidase)
Type:
Enzyme
Mol. Mass.:
210329.04
Organism:
Rattus norvegicus (Rat)
Description:
P23739
Residue:
1841
  
Inhibitor
Name:
BDBM50031480
Synonyms:
(2R,3R,4R)-2-Hydroxymethyl-1-methyl-pyrrolidine-3,4-diol | CHEMBL80148
Type:
Small organic molecule
Emp. Form.:
C6H13NO3
Mol. Mass.:
147.1723
SMILES:
CN1C[C@@H](O)[C@H](O)[C@H]1CO
: