Target
Aromatase
Ligand
BDBM50052665
Substrate
Meas. Tech.
ChEMBL_50725 (CHEMBL664249)
IC50
3200±n/a nM
Citation
 Chan, FCPotter, GABarrie, SEHaynes, BPRowlands, MGHoughton, JJarman, M 3- and 4-pyridylalkyl adamantanecarboxylates: inhibitors of human cytochrome P450(17 alpha) (17 alpha-hydroxylase/C17,20-lyase). Potential nonsteroidal agents for the treatment of prostatic cancer. J Med Chem 39:3319-23 (1996)  
Target
Name:
Aromatase
Synonyms:
ARO1 CP19A_HUMAN CYP19 CYPXIX Cytochrome P450 19A1 Cytochrome P450-C19 (CYP19) FL cytokine receptor precursor | P-450AROM
Type:
Enzyme
Mol. Mass.:
57888.92
Organism:
Homo sapiens (Human)
Description:
P11511
Residue:
503
  
Inhibitor
Name:
BDBM50052665
Synonyms:
Adamantane-1-carboxylic acid (pyridin-3-ylmethyl)-amide | CHEMBL109347
Type:
Small organic molecule
Emp. Form.:
C17H22N2O
Mol. Mass.:
270.3694
SMILES:
O=C(NCc1cccnc1)C12CC3CC(CC(C3)C1)C2
: