Target
ATP-citrate synthase
Ligand
BDBM50052993
Substrate
Meas. Tech.
ChEMBL_29519 (CHEMBL640283)
Ki
63000±n/a nM
Citation
 Gribble, ADDolle, REShaw, AMcNair, DNovelli, RNovelli, CESlingsby, BPShah, VPTew, DSaxty, BAAllen, MGroot, PHPearce, NYates, J ATP-citrate lyase as a target for hypolipidemic intervention. Design and synthesis of 2-substituted butanedioic acids as novel, potent inhibitors of the enzyme. J Med Chem 39:3569-84 (1996)  
Target
Name:
ATP-citrate synthase
Synonyms:
ACLY_RAT | Acly
Type:
PROTEIN
Mol. Mass.:
120645.65
Organism:
Rattus norvegicus
Description:
ChEMBL_857791
Residue:
1100
  
Inhibitor
Name:
BDBM50052993
Synonyms:
2-Hydroxy-2-(6-naphthalen-1-yl-hexylsulfanylmethyl)-succinic acid | CHEMBL261986
Type:
Small organic molecule
Emp. Form.:
C21H26O5S
Mol. Mass.:
390.493
SMILES:
OC(=O)CC(O)(CSCCCCCCc1cccc2ccccc12)C(O)=O
: