Target
ATP-citrate synthase
Ligand
BDBM50053017
Substrate
Meas. Tech.
ChEMBL_29519 (CHEMBL640283)
Ki
160000±n/a nM
Citation
 Gribble, ADDolle, REShaw, AMcNair, DNovelli, RNovelli, CESlingsby, BPShah, VPTew, DSaxty, BAAllen, MGroot, PHPearce, NYates, J ATP-citrate lyase as a target for hypolipidemic intervention. Design and synthesis of 2-substituted butanedioic acids as novel, potent inhibitors of the enzyme. J Med Chem 39:3569-84 (1996)  
Target
Name:
ATP-citrate synthase
Synonyms:
ACLY_RAT | Acly
Type:
PROTEIN
Mol. Mass.:
120645.65
Organism:
Rattus norvegicus
Description:
ChEMBL_857791
Residue:
1100
  
Inhibitor
Name:
BDBM50053017
Synonyms:
2-[6-(2,4-Dimethyl-phenyl)-hexylsulfanylmethyl]-2-hydroxy-succinic acid | CHEMBL118846
Type:
Small organic molecule
Emp. Form.:
C19H28O5S
Mol. Mass.:
368.488
SMILES:
Cc1ccc(CCCCCCSCC(O)(CC(O)=O)C(O)=O)c(C)c1
: