Target
Phospholipase A2
Ligand
BDBM50053102
Substrate
Meas. Tech.
ChEMBL_156184 (CHEMBL760953)
IC50
3±n/a nM
Citation
 Hagishita, SYamada, MShirahase, KOkada, TMurakami, YIto, YMatsuura, TWada, MKato, TUeno, MChikazawa, YYamada, KOno, TTeshirogi, IOhtani, M Potent inhibitors of secretory phospholipase A2: synthesis and inhibitory activities of indolizine and indene derivatives. J Med Chem 39:3636-58 (1996)  
Target
Name:
Phospholipase A2
Synonyms:
Group IB phospholipase A2 PLA2 PLA2G1B Phosphatidylcholine 2-acylhydrolase 1B Phospholipase A2 group 1B | phospholipase A2 precursor
Type:
Protein
Mol. Mass.:
16364.13
Organism:
Homo sapiens (Human)
Description:
P04054
Residue:
148
  
Inhibitor
Name:
BDBM50053102
Synonyms:
CHEMBL121245 | [1-Aminooxalyl-3-(3-chloro-benzyl)-2-ethyl-indolizin-8-yloxy]-acetic acid
Type:
Small organic molecule
Emp. Form.:
C21H19ClN2O5
Mol. Mass.:
414.839
SMILES:
CCc1c(Cc2cccc(Cl)c2)n2cccc(OCC(O)=O)c2c1C(=O)C(N)=O
: