Target
5-hydroxytryptamine receptor 1A
Ligand
BDBM50056029
Substrate
Meas. Tech.
ChEMBL_1130 (CHEMBL616075)
Ki
1±n/a nM
Citation
 Kuipers, WKruse, CGvan Wijngaarden, IStandaar, PJTulp, MTVeldman, NSpek, ALIJzerman, AP 5-HT1A-versus D2-receptor selectivity of flesinoxan and analogous N4-substituted N1-arylpiperazines. J Med Chem 40:300-12 (1997)  
Target
Name:
5-hydroxytryptamine receptor 1A
Synonyms:
5-HT-1A 5-HT1A 5-hydroxytryptamine receptor 1A (5HT1A) 5ht1a Htr1a Serotonin 1a (5-HT1a) receptor/Adrenergic receptor alpha-1 | Serotonin receptor 1A
Type:
G Protein-Coupled Receptor (GPCR)
Mol. Mass.:
46445.29
Organism:
Rattus norvegicus (rat)
Description:
Binding assays were performed using rat hippocampal membranes.
Residue:
422
  
Inhibitor
Name:
BDBM50056029
Synonyms:
CHEMBL316960 | N-{2-[4-(2,3-Dihydro-benzo[1,4]dioxin-5-yl)-2,6-dimethyl-piperazin-1-yl]-ethyl}-4-fluoro-benzamide
Type:
Small organic molecule
Emp. Form.:
C23H28FN3O3
Mol. Mass.:
413.4851
SMILES:
CC1CN(CC(C)N1CCNC(=O)c1ccc(F)cc1)c1cccc2OCCOc12
: