Target
Mitogen-activated protein kinase 14
Ligand
BDBM50071902
Substrate
Meas. Tech.
ChEBML_148191
IC50
2400±n/a nM
Citation
 de Laszlo, SEVisco, DAgarwal, LChang, LChin, JCroft, GForsyth, AFletcher, DFrantz, BHacker, CHanlon, WHarper, CKostura, MLi, BLuell, SMacCoss, MMantlo, NO'Neill, EAOrevillo, CPang, MParsons, JRolando, ASahly, YSidler, KO'Keefe, SJ Pyrroles and other heterocycles as inhibitors of p38 kinase. Bioorg Med Chem Lett 8:2689-94 (1999)  
Target
Name:
Mitogen-activated protein kinase 14
Synonyms:
Csbp1 MAP kinase p38 alpha Mapk14
Type:
PROTEIN
Mol. Mass.:
41315.23
Organism:
Rattus norvegicus
Description:
ChEMBL_148191
Residue:
360
  
Inhibitor
Name:
BDBM50071902
Synonyms:
4-(5-Phenyl-3-pyridin-4-yl-1H-pyrrol-2-yl)-phenol | CHEMBL91196
Type:
Small organic molecule
Emp. Form.:
C21H16N2O
Mol. Mass.:
312.3645
SMILES:
Oc1ccc(cc1)-c1[nH]c(cc1-c1ccncc1)-c1ccccc1
: