Target
Interstitial collagenase
Ligand
BDBM50081864
Substrate
Meas. Tech.
ChEBML_101750
IC50
6±n/a nM
Citation
 Martin, FMBeckett, RPBellamy, CLCourtney, PFDavies, SJDrummond, AHDodd, RPratt, LMPatel, SRRicketts, MLTodd, RSTuffnell, ARWard, JWWhittaker, M The synthesis and biological evaluation of non-peptidic matrix metalloproteinase inhibitors. Bioorg Med Chem Lett 9:2887-92 (1999)  
Target
Name:
Interstitial collagenase
Synonyms:
CLG MMP1 Matrix metalloproteinase-1 | Matrix metalloproteinase-1 (MMP-1)
Type:
Enzyme
Mol. Mass.:
54010.26
Organism:
Homo sapiens (Human)
Description:
P03956
Residue:
469
  
Inhibitor
Name:
BDBM50081864
Synonyms:
(2R,3R)-3-(cyclopentylmethyl)-N-hydroxy-2-((N-methylmethan-2-ylsulfonamido)methyl)-4-oxo-4-(piperidin-1-yl)butanamide (2R,3R)-3-Cyclopentylmethyl-N-hydroxy-2-[(methanesulfonyl-methyl-amino)-methyl]-4-oxo-4-piperidin-1-yl-butyramide | CHEMBL98044
Type:
Small organic molecule
Emp. Form.:
C18H33N3O5S
Mol. Mass.:
403.537
SMILES:
CN(C[C@@H]([C@@H](CC1CCCC1)C(=O)N1CCCCC1)C(=O)NO)S(C)(=O)=O
: