Target
Nociceptin receptor
Ligand
BDBM50094650
Substrate
Meas. Tech.
ChEMBL_146120 (CHEMBL754589)
Ki
1.8±n/a nM
Citation
 Shinkai, HIto, TIida, TKitao, YYamada, HUchida, I 4-Aminoquinolines: novel nociceptin antagonists with analgesic activity. J Med Chem 43:4667-77 (2001)  
Target
Name:
Nociceptin receptor
Synonyms:
KOR-3 Mu-type opioid receptor (Mu) Nociceptin Receptor (ORL1 Receptor) Nociceptin receptor (ORL-1) Nociceptin/Orphanin FQ, NOP receptor OPIATE ORL-1 OPRL1 protein ORL1 Opioid receptor like-1 Orphanin FQ receptor (ORL1) | P41146
Type:
G Protein-Coupled Receptor (GPCR)
Mol. Mass.:
40702.87
Organism:
Homo sapiens (Human)
Description:
P41146
Residue:
370
  
Inhibitor
Name:
BDBM50094650
Synonyms:
CHEMBL434060 | N-(4-Amino-2-ethyl-quinolin-6-yl)-2-(4-chloro-phenoxymethyl)-benzamide
Type:
Small organic molecule
Emp. Form.:
C25H22ClN3O2
Mol. Mass.:
431.914
SMILES:
CCc1cc(N)c2cc(NC(=O)c3ccccc3COc3ccc(Cl)cc3)ccc2n1
: