Target
Integrin alpha-L/beta-2
Ligand
BDBM50107171
Substrate
Meas. Tech.
ChEMBL_91798 (CHEMBL702305)
IC50
8±n/a nM
Citation
 Winn, MReilly, EBLiu, GHuth, JRJae, HSFreeman, JPei, ZXin, ZLynch, JKester, Jvon Geldern, TWLeitza, SDeVries, PDickinson, RMussatto, DOkasinski, GF Discovery of novel p-arylthio cinnamides as antagonists of leukocyte function-associated antigen-1/intercellular adhesion molecule-1 interaction. 4. Structure-activity relationship of substituents on the benzene ring of the cinnamide. J Med Chem 44:4393-403 (2001)  
Target
Name:
Integrin alpha-L/beta-2
Synonyms:
Integrin alpha-L/beta-2 (LFA-1) | Integrin beta-2/Leukocyte adhesion glycoprotein LFA-1 alpha
Type:
Mol. Mass.:
Description:
ASSAY_ID of EBI is 32646
Components:
This complex has 2 components.
Component 1
Name:
Integrin alpha-L
Synonyms:
CD11 antigen-like family member A CD_antigen=CD11a ITGAL LFA-1A Leukocyte adhesion glycoprotein LFA-1 alpha chain | Leukocyte function-associated molecule 1 alpha chain
Type:
PROTEIN
Mol. Mass.:
128748.90
Organism:
Homo sapiens (Human)
Description:
ChEMBL_629045
Residue:
1170
  
Component 2
Name:
Integrin beta-2
Synonyms:
CD18 ITGB2 MFI7
Type:
PROTEIN
Mol. Mass.:
84785.60
Organism:
Homo sapiens (Human)
Description:
EBI_12662
Residue:
769
  
Inhibitor
Name:
BDBM50107171
Synonyms:
1-{3-[2,3-Dichloro-4-(2-methoxy-phenylsulfanyl)-phenyl]-acryloyl}-piperidine-4-carboxylic acid | CHEMBL140085
Type:
Small organic molecule
Emp. Form.:
C22H21Cl2NO4S
Mol. Mass.:
466.377
SMILES:
COc1ccccc1Sc1ccc(\C=C\C(=O)N2CCC(CC2)C(O)=O)c(Cl)c1Cl
: