Target
Beta-lactamase
Ligand
BDBM50114525
Substrate
Meas. Tech.
ChEBML_47852
IC50
38±n/a nM
Citation
 Buynak, JDVogeti, LDoppalapudi, VRSolomon, GMChen, H Cephalosporin-derived inhibitors of beta-lactamase. Part 4: The C3 substituent. Bioorg Med Chem Lett 12:1663-6 (2002)  
Target
Name:
Beta-lactamase
Synonyms:
AMPC_ENTCL | ampC
Type:
PROTEIN
Mol. Mass.:
41306.67
Organism:
Enterobacter cloacae
Description:
ChEMBL_40258
Residue:
381
  
Inhibitor
Name:
BDBM50114525
Synonyms:
CHEMBL296738 | Sodium; (R)-5,5,8-trioxo-3-phenyl-7-[1-pyridin-2-yl-meth-(Z)-ylidene]-5lambda*6*-thia-1-aza-bicyclo[4.2.0]oct-2-ene-2-carboxylate
Type:
Small organic molecule
Emp. Form.:
C19H13N2O5S
Mol. Mass.:
381.382
SMILES:
[O-]C(=O)C1=C(CS(=O)(=O)[C@H]2N1C(=O)\C2=C\c1ccccn1)c1ccccc1
: