Target
Tyrosine-protein phosphatase non-receptor type 1
Ligand
BDBM36444
Substrate
Meas. Tech.
ChEMBL_162256 (CHEMBL772435)
IC50
5290±n/a nM
Citation
 Ahn, JHCho, SYHa, JDChu, SYJung, SHJung, YSBaek, JYChoi, IKShin, EYKang, SKKim, SSCheon, HGYang, SDChoi, JK Synthesis and PTP1B inhibition of 1,2-naphthoquinone derivatives as potent anti-diabetic agents. Bioorg Med Chem Lett 12:1941-6 (2002)  
Target
Name:
Tyrosine-protein phosphatase non-receptor type 1
Synonyms:
PTN1_HUMAN PTPN1 Protein tyrosine phosphatase-1B (PTP1B) Protein-tyrosine phosphatase 1B (PTP1B) Tyrosine-protein phosphatase non-receptor type 1 (PTP1B)
Type:
Protein phosphatase
Mol. Mass.:
49963.76
Organism:
Homo sapiens (Human)
Description:
Human recombinant GST-fusion PTP1B (1-435).
Residue:
435
  
Inhibitor
Name:
BDBM36444
Synonyms:
CHEMBL61245 ZINC01669713, 8
Type:
Small organic molecule
Emp. Form.:
C10H5O5S
Mol. Mass.:
237.209
SMILES:
[O-]S(=O)(=O)C1=CC(=O)C(=O)c2ccccc12
: