Target
Tyrosine-protein phosphatase non-receptor type 1
Ligand
BDBM50115746
Substrate
Meas. Tech.
ChEBML_162256
IC50
680.0±n/a nM
Citation
 Ahn, JHCho, SYHa, JDChu, SYJung, SHJung, YSBaek, JYChoi, IKShin, EYKang, SKKim, SSCheon, HGYang, SDChoi, JK Synthesis and PTP1B inhibition of 1,2-naphthoquinone derivatives as potent anti-diabetic agents. Bioorg Med Chem Lett 12:1941-6 (2002)  
Target
Name:
Tyrosine-protein phosphatase non-receptor type 1
Synonyms:
PTN1_HUMAN PTPN1 Protein tyrosine phosphatase-1B (PTP1B) Protein-tyrosine phosphatase 1B (PTP1B) Tyrosine-protein phosphatase non-receptor type 1 (PTP1B)
Type:
Protein phosphatase
Mol. Mass.:
49963.76
Organism:
Homo sapiens (Human)
Description:
Human recombinant GST-fusion PTP1B (1-435).
Residue:
435
  
Inhibitor
Name:
BDBM50115746
Synonyms:
3-[7-(2-Methoxycarbonyl-ethyl)-3,4-dioxo-1-phenyl-3,4-dihydro-naphthalen-2-yl]-propionic acid methyl ester | CHEMBL60918
Type:
Small organic molecule
Emp. Form.:
C24H22O6
Mol. Mass.:
406.4279
SMILES:
COC(=O)CCC1=C(c2ccccc2)c2cc(CCC(=O)OC)ccc2C(=O)C1=O
: