Target
Mitogen-activated protein kinase 14
Ligand
BDBM50122383
Substrate
Meas. Tech.
ChEBML_124486
IC50
0.600000±n/a nM
Citation
 Stelmach, JELiu, LPatel, SBPivnichny, JVScapin, GSingh, SHop, CEWang, ZStrauss, JRCameron, PMNichols, EAO'Keefe, SJO'Neill, EASchmatz, DMSchwartz, CDThompson, CMZaller, DMDoherty, JB Design and synthesis of potent, orally bioavailable dihydroquinazolinone inhibitors of p38 MAP kinase. Bioorg Med Chem Lett 13:277-80 (2002)  
Target
Name:
Mitogen-activated protein kinase 14
Synonyms:
CSAID-binding protein CSBP1 CSPB1 MAP kinase 14 MAP kinase p38 alpha MAPK14 MK14_HUMAN Mitogen-activated protein kinase p38 alpha Stress-activated protein kinase 2a | p38 MAP kinase alpha/beta
Type:
Serine/threonine-protein kinase
Mol. Mass.:
41286.76
Organism:
Homo sapiens (Human)
Description:
Q16539
Residue:
360
  
Inhibitor
Name:
BDBM50122383
Synonyms:
1-(2,6-Dichloro-phenyl)-5-(2,4-difluoro-phenyl)-7-(piperidin-4-ylamino)-3,4-dihydro-1H-quinazolin-2-one CHEMBL96432
Type:
Small organic molecule
Emp. Form.:
C25H22Cl2F2N4O
Mol. Mass.:
503.371
SMILES:
Fc1ccc(c(F)c1)-c1cc(NC2CCNCC2)cc2N(C(=O)NCc12)c1c(Cl)cccc1Cl
: