Target
Tumor necrosis factor receptor superfamily member 1A
Ligand
BDBM50123281
Substrate
Meas. Tech.
ChEBML_212214
IC50
1700±n/a nM
Citation
 Voss, MECarter, PHTebben, AJScherle, PABrown, GDThompson, LAXu, MLo, YCYang, GLiu, RQStrzemienski, PEverlof, JGTrzaskos, JMDecicco, CP Both 5-arylidene-2-thioxodihydropyrimidine-4,6(1H,5H)-diones and 3-thioxo-2,3-dihydro-1H-imidazo[1,5-a]indol-1-ones are light-dependent tumor necrosis factor-alpha antagonists. Bioorg Med Chem Lett 13:533-8 (2003)  
Target
Name:
Tumor necrosis factor receptor superfamily member 1A
Synonyms:
CD_antigen=CD120a TNF-R1 TNFAR TNFR1 TNR1A_HUMAN Tumor necrosis factor receptor superfamily member 1A Tumor necrosis factor-binding protein 1 p60
Type:
PROTEIN
Mol. Mass.:
50495.39
Organism:
Homo sapiens (Human)
Description:
ChEMBL_1509419
Residue:
455
  
Inhibitor
Name:
BDBM50123281
Synonyms:
2-Allyl-6-methoxy-3-thioxo-2,3-dihydro-imidazo[1,5-a]indol-1-one | CHEMBL150870
Type:
Small organic molecule
Emp. Form.:
C14H12N2O2S
Mol. Mass.:
272.322
SMILES:
COc1ccc2cc3C(=O)N(CC=C)C(=S)n3c2c1
: