Target
Peptide deformylase, mitochondrial
Ligand
BDBM50131294
Substrate
Meas. Tech.
ChEBML_154178
IC50
>1000±n/a nM
Citation
 Davies, SJAyscough, APBeckett, RPBragg, RAClements, JMDoel, SGrew, CLaunchbury, SBPerkins, GMPratt, LMSmith, HKSpavold, ZMThomas, SWTodd, RSWhittaker, M Structure-activity relationships of the peptide deformylase inhibitor BB-3497: modification of the methylene spacer and the P1' side chain. Bioorg Med Chem Lett 13:2709-13 (2003)  
Target
Name:
Peptide deformylase, mitochondrial
Synonyms:
DEFM_HUMAN PDF1A Peptide deformylase, mitochondrial | Polypeptide deformylase
Type:
PROTEIN
Mol. Mass.:
27023.25
Organism:
Homo sapiens (Human)
Description:
ChEMBL_154318
Residue:
243
  
Inhibitor
Name:
BDBM50131294
Synonyms:
(S)-2-{(R)-2-[(Formyl-hydroxy-amino)-methyl]-3-piperidin-1-yl-propionylamino}-3,3,N,N-tetramethyl-butyramide | CHEMBL316120
Type:
Small organic molecule
Emp. Form.:
C18H34N4O4
Mol. Mass.:
370.487
SMILES:
CN(C)C(=O)[C@@H](NC(=O)[C@@H](CN(O)C=O)CN1CCCCC1)C(C)(C)C
: