Target
Peptide deformylase, mitochondrial
Ligand
BDBM50131293
Substrate
Meas. Tech.
ChEBML_154178
IC50
50±n/a nM
Citation
 Davies, SJAyscough, APBeckett, RPBragg, RAClements, JMDoel, SGrew, CLaunchbury, SBPerkins, GMPratt, LMSmith, HKSpavold, ZMThomas, SWTodd, RSWhittaker, M Structure-activity relationships of the peptide deformylase inhibitor BB-3497: modification of the methylene spacer and the P1' side chain. Bioorg Med Chem Lett 13:2709-13 (2003)  
Target
Name:
Peptide deformylase, mitochondrial
Synonyms:
DEFM_HUMAN PDF1A Peptide deformylase, mitochondrial | Polypeptide deformylase
Type:
PROTEIN
Mol. Mass.:
27023.25
Organism:
Homo sapiens (Human)
Description:
ChEMBL_154318
Residue:
243
  
Inhibitor
Name:
BDBM50131293
Synonyms:
(R)-2-[(Formyl-hydroxy-amino)-methyl]-pentanoic acid ((S)-1-dimethylcarbamoyl-2,2-dimethyl-propyl)-amide | CHEMBL327700
Type:
Small organic molecule
Emp. Form.:
C15H29N3O4
Mol. Mass.:
315.4085
SMILES:
CCC[C@H](CN(O)C=O)C(=O)N[C@H](C(=O)N(C)C)C(C)(C)C
: