Target
Multidrug resistance-associated protein 1
Ligand
BDBM50140801
Substrate
Meas. Tech.
ChEMBL_103770 (CHEMBL714116)
IC50
675±n/a nM
Citation
 Wang, SFolkes, AChuckowree, ICockcroft, XSohal, SMiller, WMilton, JWren, SPVicker, NDepledge, PScott, JSmith, LJones, HMistry, PFaint, RThompson, DCocks, S Studies on pyrrolopyrimidines as selective inhibitors of multidrug-resistance-associated protein in multidrug resistance. J Med Chem 47:1329-38 (2004)  
Target
Name:
Multidrug resistance-associated protein 1
Synonyms:
7.6.2.2 ABCC1 ATP-binding cassette, sub-family C, member 1 isoform 1 LTC4 transporter MRP MRP1_HUMAN
Type:
Mol. Mass.:
171597.72
Organism:
Homo sapiens (Human)
Description:
P33527
Residue:
1531
  
Inhibitor
Name:
BDBM50140801
Synonyms:
4-(4-Phenethyl-piperazin-1-yl)-10-pyrimidin-2-yl-6,7,8,9-tetrahydro-pyrimido[4,5-b]indolizine | CHEMBL282592
Type:
Small organic molecule
Emp. Form.:
C26H29N7
Mol. Mass.:
439.5554
SMILES:
C(Cc1ccccc1)N1CCN(CC1)c1ncnc2c(c3CCCCn3c12)-c1ncccn1
: