Target
Coagulation factor X
Ligand
BDBM50172223
Substrate
Meas. Tech.
ChEMBL_321215 (CHEMBL884634)
IC50
29000±n/a nM
Citation
 Kohrt, JTFilipski, KJCody, WLCai, CDudley, DAVan Huis, CAWillardsen, JARapundalo, STSaiya-Cork, KLeadley, RJNarasimhan, LZhang, EWhitlow, MAdler, MMcLean, KChou, YLMcKnight, CArnaiz, DOShaw, KJLight, DREdmunds, JJ The discovery of fluoropyridine-based inhibitors of the Factor VIIa/TF complex. Bioorg Med Chem Lett 15:4752-6 (2005)  
Target
Name:
Coagulation factor X
Synonyms:
Activated coagulation factor X (FXa) Coagulation factor X precursor F10 Factor X heavy chain Factor Xa Stuart-Prower factor
Type:
Enzyme
Mol. Mass.:
54726.60
Organism:
Homo sapiens (Human)
Description:
Residue:
488
  
Inhibitor
Name:
BDBM50172223
Synonyms:
2-[6-(3-Carbamimidoyl-phenoxy)-3,5-difluoro-4-(1-methyl-3-phenyl-propylamino)-pyridin-2-yloxy]-5-methyl-benzoic acid; TFA | CHEMBL193933
Type:
Small organic molecule
Emp. Form.:
C30H28F2N4O4
Mol. Mass.:
546.5645
SMILES:
CC(CCc1ccccc1)Nc1c(F)c(Oc2cccc(c2)C(N)=N)nc(Oc2ccc(C)cc2C(O)=O)c1F
: