Target
Proteinase-activated receptor 1
Ligand
BDBM50173419
Substrate
Meas. Tech.
ChEMBL_321545 (CHEMBL881483)
IC50
44.0±n/a nM
Citation
 Chackalamannil, SXia, YGreenlee, WJClasby, MDoller, DTsai, HAsberom, TCzarniecki, MAhn, HSBoykow, GFoster, CAgans-Fantuzzi, JBryant, MLau, JChintala, M Discovery of potent orally active thrombin receptor (protease activated receptor 1) antagonists as novel antithrombotic agents. J Med Chem 48:5884-7 (2005)  
Target
Name:
Proteinase-activated receptor 1
Synonyms:
CF2R F2R PAR1 Proteinase activated receptor 1 TR Thrombin receptor/ Proteinase-activated receptor 1(Par-1)
Type:
Protein
Mol. Mass.:
47450.07
Organism:
Homo sapiens (Human)
Description:
P25116
Residue:
425
  
Inhibitor
Name:
BDBM50173419
Synonyms:
(3R,3aS,4S,4aR,8aS,9aR)-3-Methyl-4-{(E)-2-[5-(3-trifluoromethyl-phenyl)-pyridin-2-yl]-vinyl}-decahydro-naphtho[2,3-c]furan-1-one (3R,3aS,4S,4aR,8aS,9aR,E)-3-methyl-4-(2-(5-(3-(trifluoromethyl)phenyl)pyridin-2-yl)vinyl)-decahydronaphtho[2,3-c]furan-1(3H)-one SCH-205831
Type:
Small organic molecule
Emp. Form.:
C27H28F3NO2
Mol. Mass.:
455.5119
SMILES:
C[C@H]1OC(=O)[C@@H]2C[C@@H]3CCCC[C@H]3[C@H](\C=C\c3ccc(cn3)-c3cccc(c3)C(F)(F)F)[C@H]12
: