Target
Glycogen synthase kinase-3 beta
Ligand
BDBM50220373
Substrate
Meas. Tech.
ChEMBL_457307 (CHEMBL941840)
IC50
15±n/a nM
Citation
 Shin, DLee, SCHeo, YSLee, WYCho, YSKim, YEHyun, YLCho, JMLee, YSRo, S Design and synthesis of 7-hydroxy-1H-benzoimidazole derivatives as novel inhibitors of glycogen synthase kinase-3beta. Bioorg Med Chem Lett 17:5686-9 (2007)  
Target
Name:
Glycogen synthase kinase-3 beta
Synonyms:
GSK-3 beta GSK3B Glycogen synthase kinase 3 beta (GSK3B) Glycogen synthase kinase-3 beta (GSK-3B) Glycogen synthase kinase-3 beta (GSK3B) Glycogen synthase kinase-3beta (GSK3B) | Serine/threonine-protein kinase GSK3B
Type:
Enzyme
Mol. Mass.:
46756.38
Organism:
Homo sapiens (Human)
Description:
P49841
Residue:
420
  
Inhibitor
Name:
BDBM50220373
Synonyms:
2-(2,4-DICHLORO-PHENYL)-7-HYDROXY-1H-BENZOIMIDAZOLE-4-CARBOXYLIC ACID [2-(4-METHANESULFONYLAMINO-PHENYL)-ETHYL]-AMIDE N-(4-(methylsulfonamido)phenethyl)-2-(2,4-dichlorophenyl)-7-hydroxy-1H-benzo[d]imidazole-4-carboxamide
Type:
Small organic molecule
Emp. Form.:
C23H20Cl2N4O4S
Mol. Mass.:
519.4
SMILES:
CS(=O)(=O)Nc1ccc(CCNC(=O)c2ccc(O)c3nc([nH]c23)-c2ccc(Cl)cc2Cl)cc1
: