Target
cGMP-specific 3',5'-cyclic phosphodiesterase
Ligand
BDBM50246067
Substrate
Meas. Tech.
ChEMBL_558442 (CHEMBL963848)
IC50
71±n/a nM
Citation
 Kim, YHChoi, HLee, JHwang, ICMoon, SKKim, SJLee, HWIm, DSLee, SSAhn, SKKim, SWHan, CKYoon, JHLee, KJChoi, NS Quinazolines as potent and highly selective PDE5 inhibitors as potential therapeutics for male erectile dysfunction. Bioorg Med Chem Lett 18:6279-82 (2008)  
Target
Name:
cGMP-specific 3',5'-cyclic phosphodiesterase
Synonyms:
PDE5 PDE5A_BOVIN | Phosphodiesterase 5A
Type:
PROTEIN
Mol. Mass.:
98615.45
Organism:
Bos taurus
Description:
ChEMBL_155186
Residue:
865
  
Inhibitor
Name:
BDBM50246067
Synonyms:
CHEMBL524871 | N4-(3-chloro-4-methoxybenzyl)-N7,N7-dimethyl-6-nitroquinazoline-4,7-diamine
Type:
Small organic molecule
Emp. Form.:
C18H18ClN5O3
Mol. Mass.:
387.82
SMILES:
COc1ccc(CNc2ncnc3cc(N(C)C)c(cc23)[N+]([O-])=O)cc1Cl
: