Target
cGMP-specific 3',5'-cyclic phosphodiesterase
Ligand
BDBM50246197
Substrate
Meas. Tech.
ChEMBL_558442 (CHEMBL963848)
IC50
18±n/a nM
Citation
 Kim, YHChoi, HLee, JHwang, ICMoon, SKKim, SJLee, HWIm, DSLee, SSAhn, SKKim, SWHan, CKYoon, JHLee, KJChoi, NS Quinazolines as potent and highly selective PDE5 inhibitors as potential therapeutics for male erectile dysfunction. Bioorg Med Chem Lett 18:6279-82 (2008)  
Target
Name:
cGMP-specific 3',5'-cyclic phosphodiesterase
Synonyms:
PDE5 PDE5A_BOVIN | Phosphodiesterase 5A
Type:
PROTEIN
Mol. Mass.:
98615.45
Organism:
Bos taurus
Description:
ChEMBL_155186
Residue:
865
  
Inhibitor
Name:
BDBM50246197
Synonyms:
CHEMBL520074 | N-(4-(3-chloro-4-methoxybenzylamino)-8-allyl-7-methoxyquinazolin-6-yl)propionamide
Type:
Small organic molecule
Emp. Form.:
C23H25ClN4O3
Mol. Mass.:
440.923
SMILES:
CCC(=O)Nc1cc2c(NCc3ccc(OC)c(Cl)c3)ncnc2c(CC=C)c1OC
: