Target
cGMP-specific 3',5'-cyclic phosphodiesterase
Ligand
BDBM50246199
Substrate
Meas. Tech.
ChEMBL_558442 (CHEMBL963848)
IC50
10±n/a nM
Citation
 Kim, YHChoi, HLee, JHwang, ICMoon, SKKim, SJLee, HWIm, DSLee, SSAhn, SKKim, SWHan, CKYoon, JHLee, KJChoi, NS Quinazolines as potent and highly selective PDE5 inhibitors as potential therapeutics for male erectile dysfunction. Bioorg Med Chem Lett 18:6279-82 (2008)  
Target
Name:
cGMP-specific 3',5'-cyclic phosphodiesterase
Synonyms:
PDE5 PDE5A_BOVIN | Phosphodiesterase 5A
Type:
PROTEIN
Mol. Mass.:
98615.45
Organism:
Bos taurus
Description:
ChEMBL_155186
Residue:
865
  
Inhibitor
Name:
BDBM50246199
Synonyms:
CHEMBL488265 | N-(4-(3-chloro-4-methoxybenzylamino)-8-(2-hydroxyethyl)-7-methoxyquinazolin-6-yl)acetamide
Type:
Small organic molecule
Emp. Form.:
C21H23ClN4O4
Mol. Mass.:
430.885
SMILES:
COc1ccc(CNc2ncnc3c(CCO)c(OC)c(NC(C)=O)cc23)cc1Cl
: