Target
B1 bradykinin receptor
Ligand
BDBM50254457
Substrate
Meas. Tech.
ChEMBL_560708 (CHEMBL1010843)
Ki
21±n/a nM
Citation
 Cole, AGMetzger, ABrescia, MRQin, LYAppell, KCBrain, CTHallett, AGanju, PDenholm, AAWareing, JRRitchie, TJDrake, GMBevan, SJMacGloinn, AMcBryde, APatel, VOakley, PJNunez, XGstach, HSchneider, PBaldwin, JJDolle, REMcDonald, EHenderson, I Sulfonamido-aryl ethers as bradykinin B1 receptor antagonists. Bioorg Med Chem Lett 19:119-22 (2008)  
Target
Name:
B1 bradykinin receptor
Synonyms:
B1 BRADYKININ B1R BK-1 receptor BRADYB1 | Bradykinin B1 receptor
Type:
Enzyme
Mol. Mass.:
40508.87
Organism:
Homo sapiens (Human)
Description:
P46663
Residue:
353
  
Inhibitor
Name:
BDBM50254457
Synonyms:
CHEMBL443207 | N-(2-chlorobenzyl)-2-(N-(3-chloro-4-isobutoxybenzyl)-4-((4-methylpiperazin-1-yl)methyl)phenylsulfonamido)acetamide
Type:
Small organic molecule
Emp. Form.:
C32H40Cl2N4O4S
Mol. Mass.:
647.655
SMILES:
CC(C)COc1ccc(CN(CC(=O)NCc2ccccc2Cl)S(=O)(=O)c2ccc(CN3CCN(C)CC3)cc2)cc1Cl
: