Target
Rod cGMP-specific 3',5'-cyclic phosphodiesterase subunit alpha
Ligand
BDBM50304789
Substrate
Meas. Tech.
ChEMBL_605924 (CHEMBL1068541)
IC50
320±n/a nM
Citation
 Choi, HLee, JKim, YHIm, DSHwang, ICKim, SJMoon, SKLee, HWLee, SSAhn, SKKim, SWChoi, NSLee, KJ Discovery of potent, selective, and orally bioavailable PDE5 inhibitor: Methyl-4-(3-chloro-4-methoxybenzylamino)-8-(2-hydroxyethyl)-7-methoxyquinazolin-6-ylmethylcarbamate (CKD 533). Bioorg Med Chem Lett 20:383-6 (2010)  
Target
Name:
Rod cGMP-specific 3',5'-cyclic phosphodiesterase subunit alpha
Synonyms:
PDE6A PDEA Phosphodiesterase 6A
Type:
Enzyme
Mol. Mass.:
99320.22
Organism:
Bos taurus (Bovine)
Description:
P11541
Residue:
859
  
Inhibitor
Name:
BDBM50304789
Synonyms:
CHEMBL604271 | N-(4-(3-chloro-4-methoxybenzylamino)-8-(2-hydroxyethyl)-7-methoxyquinazolin-6-yl)-N-methylpropionamide
Type:
Small organic molecule
Emp. Form.:
C23H27ClN4O4
Mol. Mass.:
458.938
SMILES:
CCC(=O)N(C)c1cc2c(NCc3ccc(OC)c(Cl)c3)ncnc2c(CCO)c1OC
: