Target
cGMP-specific 3',5'-cyclic phosphodiesterase
Ligand
BDBM50304791
Substrate
Meas. Tech.
ChEMBL_605926 (CHEMBL1068543)
IC50
3±n/a nM
Citation
 Choi, HLee, JKim, YHIm, DSHwang, ICKim, SJMoon, SKLee, HWLee, SSAhn, SKKim, SWChoi, NSLee, KJ Discovery of potent, selective, and orally bioavailable PDE5 inhibitor: Methyl-4-(3-chloro-4-methoxybenzylamino)-8-(2-hydroxyethyl)-7-methoxyquinazolin-6-ylmethylcarbamate (CKD 533). Bioorg Med Chem Lett 20:383-6 (2010)  
Target
Name:
cGMP-specific 3',5'-cyclic phosphodiesterase
Synonyms:
PDE5 PDE5A_BOVIN | Phosphodiesterase 5A
Type:
PROTEIN
Mol. Mass.:
98615.45
Organism:
Bos taurus
Description:
ChEMBL_155186
Residue:
865
  
Inhibitor
Name:
BDBM50304791
Synonyms:
CHEMBL592986 | N-(4-(3-chloro-4-methoxybenzylamino)-8-(2-hydroxyethyl)-7-methoxyquinazolin-6-yl)-N-methylisobutyramide
Type:
Small organic molecule
Emp. Form.:
C24H29ClN4O4
Mol. Mass.:
472.964
SMILES:
COc1ccc(CNc2ncnc3c(CCO)c(OC)c(cc23)N(C)C(=O)C(C)C)cc1Cl
: