Target
Integrin alpha-L
Ligand
BDBM50324826
Substrate
Meas. Tech.
ChEMBL_651449 (CHEMBL1227566)
IC50
1.4±n/a nM
Citation
 Zhong, MShen, WBarr, KJArbitrario, JPArkin, MRBui, MChen, TCunningham, BCEvanchik, MJHanan, EJHoch, UHuen, KHyde, JKumer, JLLac, TLawrence, CEMartell, JROslob, JDPaulvannan, KPrabhu, SSilverman, JAWright, JYu, CHZhu, JFlanagan, WM Discovery of tetrahydroisoquinoline (THIQ) derivatives as potent and orally bioavailable LFA-1/ICAM-1 antagonists. Bioorg Med Chem Lett 20:5269-73 (2010)  
Target
Name:
Integrin alpha-L
Synonyms:
CD11 antigen-like family member A CD_antigen=CD11a ITGAL LFA-1A Leukocyte adhesion glycoprotein LFA-1 alpha chain | Leukocyte function-associated molecule 1 alpha chain
Type:
PROTEIN
Mol. Mass.:
128748.90
Organism:
Homo sapiens (Human)
Description:
ChEMBL_629045
Residue:
1170
  
Inhibitor
Name:
BDBM50324826
Synonyms:
(2S)-2-(2,6-dichloro-4-(3-hydroxy-3-(3-hydroxyphenyl)propyl)benzamido)-3-(thiophene-2-carboxamido)propanoic acid | CHEMBL1221918
Type:
Small organic molecule
Emp. Form.:
C24H22Cl2N2O6S
Mol. Mass.:
537.412
SMILES:
OC(CCc1cc(Cl)c(C(=O)N[C@@H](CNC(=O)c2cccs2)C(O)=O)c(Cl)c1)c1cccc(O)c1
: