Target
Protein farnesyltransferase subunit beta/geranylgeranyltransferase type-1 subunit alpha
Ligand
BDBM50327998
Substrate
Meas. Tech.
ChEBML_665229
IC50
89±n/a nM
Citation
 Fletcher, SKeaney, EPCummings, CGBlaskovich, MAHast, MAGlenn, MPChang, SYBucher, CJFloyd, RJKatt, WPGelb, MHVan Voorhis, WCBeese, LSSebti, SMHamilton, AD Structure-based design and synthesis of potent, ethylenediamine-based, mammalian farnesyltransferase inhibitors as anticancer agents. J Med Chem 53:6867-88 (2010)  
Target
Name:
Protein farnesyltransferase subunit beta/geranylgeranyltransferase type-1 subunit alpha
Synonyms:
Protein farnesyltransferase | Protein farnesyltransferase beta/geranylgeranyltransferase type I alpha subunit
Type:
Mol. Mass.:
Description:
ASSAY_ID of EBI is 38702
Components:
This complex has 2 components.
Component 1
Name:
Protein farnesyltransferase/geranylgeranyltransferase type-1 subunit alpha
Synonyms:
CAAX farnesyltransferase subunit alpha FTase-alpha GGTase-I-alpha Protein farnesyltransferase/geranylgeranyltransferase type-1 subunit alpha Type I protein geranyl-geranyltransferase subunit alpha
Type:
PROTEIN
Mol. Mass.:
43994.09
Organism:
Mus musculus
Description:
EBI_10570
Residue:
377
  
Component 2
Name:
Protein farnesyltransferase subunit beta
Synonyms:
FNTB_MOUSE Protein farnesyltransferase
Type:
PROTEIN
Mol. Mass.:
48811.61
Organism:
Mus musculus
Description:
EBI_12341
Residue:
437
  
Inhibitor
Name:
BDBM50327998
Synonyms:
CHEMBL1258350 | N-(2-((4-cyano-2-fluorophenyl)((1-methyl-1H-imidazol-5-yl)methyl)amino)ethyl)-N-(cyclohexylmethyl)pyridine-2-sulfonamide
Type:
Small organic molecule
Emp. Form.:
C26H31FN6O2S
Mol. Mass.:
510.627
SMILES:
Cn1cncc1CN(CCN(CC1CCCCC1)S(=O)(=O)c1ccccn1)c1ccc(cc1F)C#N
: