Target
Sodium channel protein type 10 subunit alpha
Ligand
BDBM50332646
Substrate
Meas. Tech.
ChEMBL_697955 (CHEMBL1633015)
IC50
1513000±n/a nM
Citation
 Tyagarajan, SChakravarty, PKZhou, BTaylor, BEid, RFisher, MHParsons, WHWyvratt, MJLyons, KAKlatt, TLi, XKumar, SWilliams, BFelix, JPriest, BTBrochu, RMWarren, VSmith, MGarcia, MKaczorowski, GJMartin, WJAbbadie, CMcGowan, EJochnowitz, NWeber, ADuffy, JL Discovery of a novel class of biphenyl pyrazole sodium channel blockers for treatment of neuropathic pain. Bioorg Med Chem Lett 20:7479-82 (2010)  
Target
Name:
Sodium channel protein type 10 subunit alpha
Synonyms:
PN3 SCN10A Sodium channel alpha subunit Sodium channel protein type X alpha subunit fret-membrane potential nav1.8 | hPN3
Type:
Enzyme
Mol. Mass.:
220609.21
Organism:
Homo sapiens (Human)
Description:
Q9Y5Y9
Residue:
1956
  
Inhibitor
Name:
BDBM50332646
Synonyms:
1-(2'-fluoro-3'-(trifluoromethoxy)biphenyl-3-yl)-1H-pyrazole-3,5-dicarboxamide | CHEMBL1631097
Type:
Small organic molecule
Emp. Form.:
C18H12F4N4O3
Mol. Mass.:
408.3065
SMILES:
NC(=O)c1cc(C(N)=O)n(n1)-c1cccc(c1)-c1cccc(OC(F)(F)F)c1F
: