Target
11-beta-hydroxysteroid dehydrogenase 1
Ligand
BDBM50334708
Substrate
Meas. Tech.
ChEMBL_699259 (CHEMBL1647079)
IC50
3.00±n/a nM
Citation
 Kwon, SWKang, SKLee, JHBok, JHKim, CHDal Rhee, SJung, WHKim, HYBae, MASong, JSHa, DCCheon, HGKim, KYAhn, JH Synthesis and 11ß hydroxysteroid dehydrogenase 1 inhibition of thiazolidine derivatives with an adamantyl group. Bioorg Med Chem Lett 21:435-9 (2010)  
Target
Name:
11-beta-hydroxysteroid dehydrogenase 1
Synonyms:
11-DH 11-beta-Hydroxysteroid Dehydrogenase 1 (11-beta-HSD1) 11-beta-hydroxysteroid dehydrogenase 1 (11HSD1) Corticosteroid 11-beta-dehydrogenase isozyme 1 (11-beta-HSD-1) Corticosteroid 11-beta-dehydrogenase isozyme 1 (11beta-HSD1) HSD11 HSD11L | SDR26C1
Type:
Enzyme
Mol. Mass.:
32409.16
Organism:
Homo sapiens (Human)
Description:
P28845
Residue:
292
  
Inhibitor
Name:
BDBM50334708
Synonyms:
(E)-3-[(2-Fluorophenyl)sulfonyl]-N-[5-(aminocarbonyl)tricyclo[3,3,1,13,7]dec-2-yl]thiazolidine-2-carboxamide (Z)-3-(2-Fluoro-benzenesulfonyl)-thiazolidine-2-carboxylic acid(5-carbamoyl-adamantan-2-yl)-amide CHEMBL1642622
Type:
Small organic molecule
Emp. Form.:
C21H26FN3O4S2
Mol. Mass.:
467.577
SMILES:
NC(=O)C12CC3CC(C1)C(NC(=O)C1SCCN1S(=O)(=O)c1ccccc1F)C(C3)C2
: