Target
Bifunctional epoxide hydrolase 2
Ligand
BDBM50335969
Substrate
Meas. Tech.
ChEMBL_716998 (CHEMBL1671070)
IC50
38±n/a nM
Citation
 Anandan, SKWebb, HKChen, DWang, YXAavula, BRCases, SCheng, YDo, ZNMehra, UTran, VVincelette, JWaszczuk, JWhite, KWong, KRZhang, LNJones, PDHammock, BDPatel, DVWhitcomb, RMacIntyre, DESabry, JGless, R 1-(1-acetyl-piperidin-4-yl)-3-adamantan-1-yl-urea (AR9281) as a potent, selective, and orally available soluble epoxide hydrolase inhibitor with efficacy in rodent models of hypertension and dysglycemia. Bioorg Med Chem Lett 21:983-8 (2011)  
Target
Name:
Bifunctional epoxide hydrolase 2
Synonyms:
Cytosolic epoxide hydrolase 2 EPHX2 HYES_HUMAN Soluble epoxide hydrolase (sEH) | epoxide hydrolase 2, cytoplasmic
Type:
Enzyme
Mol. Mass.:
62613.07
Organism:
Homo sapiens (Human)
Description:
P34913
Residue:
555
  
Inhibitor
Name:
BDBM50335969
Synonyms:
1-(1-acetylpiperidin-4-yl)-3-(4,4-dimethylcyclohexyl)urea | CHEMBL1668930
Type:
Small organic molecule
Emp. Form.:
C16H29N3O2
Mol. Mass.:
295.4204
SMILES:
CC(=O)N1CCC(CC1)NC(=O)NC1CCC(C)(C)CC1
: