Target
Transient receptor potential cation channel subfamily V member 1
Ligand
BDBM50336159
Substrate
Meas. Tech.
ChEMBL_718134 (CHEMBL1671587)
IC50
46±n/a nM
Citation
 Palin, RAbernethy, LAnsari, NCameron, KClarkson, TDempster, MDunn, DEasson, AMEdwards, DMaclean, JEverett, KFeilden, HHo, KKKultgen, SLittlewood, PMcArthur, DMcGregor, DMcLuskey, HNeagu, INeale, SNisbet, LAOhlmeyer, MPham, QRatcliffe, PRong, YRoughton, ASammons, MSwanson, RTracey, HWalker, G Structure-activity studies of a novel series of isoxazole-3-carboxamide derivatives as TRPV1 antagonists. Bioorg Med Chem Lett 21:892-8 (2011)  
Target
Name:
Transient receptor potential cation channel subfamily V member 1
Synonyms:
Capsaicin receptor Osm-9-like TRP channel 1 TRPV1_HUMAN Transient receptor potential cation channel subfamily V member 1 (TRPV1) Transient receptor potential cation channel subfamily V member 1(TRPV1) Vanilloid VR1 Vanilloid receptor 1 Vanilloid receptor 1 (VRI/TRPV1)
Type:
Protein
Mol. Mass.:
94960.75
Organism:
Homo sapiens (Human)
Description:
Q8NER1
Residue:
839
  
Inhibitor
Name:
BDBM50336159
Synonyms:
4-bromo-N-cyclopentyl-5-(4-(trifluoromethyl)phenyl)isoxazole-3-carboxamide | CHEMBL1669547
Type:
Small organic molecule
Emp. Form.:
C16H14BrF3N2O2
Mol. Mass.:
403.194
SMILES:
FC(F)(F)c1ccc(cc1)-c1onc(C(=O)NC2CCCC2)c1Br
: