Target
Mitogen-activated protein kinase 14
Ligand
BDBM50344129
Substrate
Meas. Tech.
ChEMBL_747811 (CHEMBL1781010)
IC50
38±n/a nM
Citation
 Soth, MAbbot, SAbubakari, AArora, NArzeno, HBilledeau, RDewdney, NDurkin, KFrauchiger, SGhate, MGoldstein, DMHill, RJKuglstatter, ALi, FLoe, BMcCaleb, KMcIntosh, JPapp, EPark, JStahl, MSung, MLSuttman, RSwinney, DCWeller, PWong, BZecic, HGabriel, T 3-Amino-pyrazolo[3,4-d]pyrimidines as p38a kinase inhibitors: design and development to a highly selective lead. Bioorg Med Chem Lett 21:3452-6 (2011)  
Target
Name:
Mitogen-activated protein kinase 14
Synonyms:
CSAID-binding protein CSBP1 CSPB1 MAP kinase 14 MAP kinase p38 alpha MAPK14 MK14_HUMAN Mitogen-activated protein kinase p38 alpha Stress-activated protein kinase 2a | p38 MAP kinase alpha/beta
Type:
Serine/threonine-protein kinase
Mol. Mass.:
41286.76
Organism:
Homo sapiens (Human)
Description:
Q16539
Residue:
360
  
Inhibitor
Name:
BDBM50344129
Synonyms:
6-(2,4-difluorophenoxy)-N-(1-(methylsulfonyl)piperidin-4-yl)-1H-pyrazolo[3,4-d]pyrimidin-3-amine | CHEMBL1778106
Type:
Small organic molecule
Emp. Form.:
C17H18F2N6O3S
Mol. Mass.:
424.425
SMILES:
CS(=O)(=O)N1CCC(CC1)Nc1[nH]nc2nc(Oc3ccc(F)cc3F)ncc12
: