Target
Nicotinamide phosphoribosyltransferase
Ligand
BDBM50347433
Substrate
Meas. Tech.
ChEMBL_754944 (CHEMBL1805766)
IC50
0.45±n/a nM
Citation
 Lockman, JWMurphy, BRZigar, DFJudd, WRSlattum, PMGao, ZHOstanin, KGreen, JMcKinnon, RTerry-Lorenzo, RTFleischer, TCBoniface, JJShenderovich, MWillardsen, JA Analogues of 4-[(7-Bromo-2-methyl-4-oxo-3H-quinazolin-6-yl)methylprop-2-ynylamino]-N-(3-pyridylmethyl)benzamide (CB-30865) as potent inhibitors of nicotinamide phosphoribosyltransferase (Nampt). J Med Chem 53:8734-46 (2010)  
Target
Name:
Nicotinamide phosphoribosyltransferase
Synonyms:
NAMPT NAmPRTase Nicotinamide phosphoribosyltransferase (NAMPT) PBEF1 | Pre-B-cell colony-enhancing factor 1
Type:
Enzyme
Mol. Mass.:
55524.98
Organism:
Homo sapiens (Human)
Description:
P43490
Residue:
491
  
Inhibitor
Name:
BDBM50347433
Synonyms:
CHEMBL1801864
Type:
Small organic molecule
Emp. Form.:
C27H27ClN6O2
Mol. Mass.:
502.995
SMILES:
[#6]\[#6](-[#6])=[#6]\[#6]-[#7](-[#6]-c1cc2c(cc1Cl)nnn(-[#6])c2=O)-c1ccc(cc1)-[#6](=O)-[#7]-[#6]-c1cccnc1
: