Target
Aurora kinase A
Ligand
BDBM50352200
Substrate
Meas. Tech.
ChEMBL_767346 (CHEMBL1825458)
IC50
110±n/a nM
Citation
 Zhang, LFan, JChong, JHCesena, ATam, BYGilson, CBoykin, CWang, DAivazian, DMarcotte, DXiao, GLe Brazidec, JYPiao, JLundgren, KHong, KVu, KNguyen, KGan, LSSilvian, LLing, LTeng, MReff, MTakeda, NTimple, NWang, QMorena, RKhan, SZhao, SLi, TLee, WCTaveras, AGChao, J Design, synthesis, and biological evaluation of pyrazolopyrimidine-sulfonamides as potent multiple-mitotic kinase (MMK) inhibitors (part I). Bioorg Med Chem Lett 21:5633-7 (2011)  
Target
Name:
Aurora kinase A
Synonyms:
AIK ARK1 AURKA AYK1 Aurora kinase A (AURA) Aurora kinase A (Aurora A) Aurora-related kinase 1 BTAK Breast-tumor-amplified kinase STK15 Serine/threonine kinase 15 Serine/threonine-protein kinase aurora A hARK1
Type:
Serine/threonine-protein kinase
Mol. Mass.:
45830.98
Organism:
Homo sapiens (Human)
Description:
O14965
Residue:
403
  
Inhibitor
Name:
BDBM50352200
Synonyms:
CHEMBL1825100
Type:
Small organic molecule
Emp. Form.:
C20H27N7O3S
Mol. Mass.:
445.538
SMILES:
CS(=O)(=O)N(CCO)c1ccc(Nc2ncc3cnn(C4CCCCCC4)c3n2)cn1
: