Target
cAMP-specific 3',5'-cyclic phosphodiesterase 4B
Ligand
BDBM14774
Substrate
Meas. Tech.
ChEMBL_769283 (CHEMBL1833210)
IC50
0.69±n/a nM
Citation
 Taltavull, JSerrat, JGràcia, JGavaldà, ACórdoba, MCalama, EMontero, JLAndrés, MMiralpeix, MVilella, DHernández, BBeleta, JRyder, HPagès, L Synthesis and biological activity of pyrido[3',2':4,5]furo[3,2-d]pyrimidine derivatives as novel and potent phosphodiesterase type 4 inhibitors. Eur J Med Chem 46:4946-56 (2011)  
Target
Name:
cAMP-specific 3',5'-cyclic phosphodiesterase 4B
Synonyms:
3',5'-cyclic phosphodiesterase Isoform PDE4B1 PDE4B PDE4B_HUMAN Phosphodiesterase 4B (PDE4B) Phosphodiesterase Type 4 (PDE4B)
Type:
Protein
Mol. Mass.:
83318.87
Organism:
Homo sapiens (Human)
Description:
Q07343
Residue:
736
  
Inhibitor
Name:
BDBM14774
Synonyms:
3-(cyclopropylmethoxy)-N-(3,5-dichloropyridin-4-yl)-4-(difluoromethoxy)benzamide DAXAS Roflumilast
Type:
Small organic molecule
Emp. Form.:
C17H14Cl2F2N2O3
Mol. Mass.:
403.207
SMILES:
FC(F)Oc1ccc(cc1OCC1CC1)C(=O)Nc1c(Cl)cncc1Cl
: