Target
Peroxisome proliferator-activated receptor gamma
Ligand
BDBM50361355
Substrate
Meas. Tech.
ChEMBL_795134 (CHEMBL1936606)
EC50
40±n/a nM
Citation
 Rikimaru, KWakabayashi, TAbe, HImoto, HMaekawa, TUjikawa, OMurase, KMatsuo, TMatsumoto, MNomura, CTsuge, HArimura, NKawakami, KSakamoto, JFunami, MMol, CDSnell, GPBragstad, KASang, BCDougan, DRTanaka, TKatayama, NHoriguchi, YMomose, Y A new class of non-thiazolidinedione, non-carboxylic-acid-based highly selective peroxisome proliferator-activated receptor (PPAR)¿ agonists: design and synthesis of benzylpyrazole acylsulfonamides. Bioorg Med Chem 20:714-33 (2012)  
Target
Name:
Peroxisome proliferator-activated receptor gamma
Synonyms:
NR1C3 PPAR-gamma PPARG_HUMAN Peroxisome proliferator-activated receptor gamma (PPAR gamma) Peroxisome proliferator-activated receptor gamma (PPARĪ³) peroxisome proliferator-activated receptor gamma isoform 2
Type:
Nuclear Receptor
Mol. Mass.:
57613.46
Organism:
Homo sapiens (Human)
Description:
P37231
Residue:
505
  
Inhibitor
Name:
BDBM50361355
Synonyms:
CHEMBL1933821
Type:
Small organic molecule
Emp. Form.:
C20H27Cl2N3O4S
Mol. Mass.:
476.417
SMILES:
CCCCS(=O)(=O)NC(=O)CCc1cc(OC(C)C)nn1Cc1ccc(Cl)cc1Cl
: