Target
Sphingosine 1-phosphate receptor 3
Ligand
BDBM50364594
Substrate
Meas. Tech.
ChEMBL_802669 (CHEMBL1953077)
EC50
>20000±n/a nM
Citation
 Nakamura, TAsano, MSekiguchi, YMizuno, YTamaki, KKimura, TNara, FKawase, YShimozato, TDoi, HKagari, TTomisato, WInoue, RNagasaki, MYuita, HOguchi-Oshima, KKaneko, RWatanabe, NAbe, YNishi, T Discovery of CS-2100, a potent, orally active and S1P3-sparing S1P1 agonist. Bioorg Med Chem Lett 22:1788-92 (2012)  
Target
Name:
Sphingosine 1-phosphate receptor 3
Synonyms:
C9orf108 EDG3 S1P receptor 3 S1P3 S1PR3_HUMAN Sphingosine 1-phosphate receptor 3 (S1P3) | Sphingosine 1-phosphate receptor Edg-3
Type:
G Protein-Coupled Receptor (GPCR)
Mol. Mass.:
42278.13
Organism:
Homo sapiens (Human)
Description:
Q99500
Residue:
378
  
Inhibitor
Name:
BDBM50364594
Synonyms:
CHEMBL1951148
Type:
Small organic molecule
Emp. Form.:
C23H19N3O3S
Mol. Mass.:
417.48
SMILES:
OC(=O)C1CN(Cc2cc(cs2)-c2noc(n2)-c2cccc(c2)-c2ccccc2)C1
: