Target
Cytochrome P450 1A1
Ligand
BDBM50364743
Substrate
Meas. Tech.
ChEMBL_803115 (CHEMBL1954551)
IC50
>50000±n/a nM
Citation
 Cumming, JGTucker, HOldfield, JFielding, CHighton, AFaull, AWild, MBrown, DWells, SShaw, J Balancing hERG affinity and absorption in the discovery of AZD5672, an orally active CCR5 antagonist for the treatment of rheumatoid arthritis. Bioorg Med Chem Lett 22:1655-9 (2012)  
Target
Name:
Cytochrome P450 1A1
Synonyms:
CP1A1_HUMAN CYPIA1 Cytochrome P450 1A1 P450 form 6 P450-P1
Type:
Protein
Mol. Mass.:
58177.23
Organism:
Homo sapiens (Human)
Description:
P04798
Residue:
512
  
Inhibitor
Name:
BDBM50364743
Synonyms:
CHEMBL1951914
Type:
Small organic molecule
Emp. Form.:
C31H43F2N3O5S2
Mol. Mass.:
639.817
SMILES:
CCN(C1CCN(CC[C@H](C2CCN(CC2)S(C)(=O)=O)c2cc(F)cc(F)c2)CC1)C(=O)Cc1ccc(cc1)S(C)(=O)=O
: