Target
C-C chemokine receptor type 5
Ligand
BDBM50364759
Substrate
Meas. Tech.
ChEMBL_803091 (CHEMBL1954527)
IC50
15±n/a nM
Citation
 Cumming, JGTucker, HOldfield, JFielding, CHighton, AFaull, AWild, MBrown, DWells, SShaw, J Balancing hERG affinity and absorption in the discovery of AZD5672, an orally active CCR5 antagonist for the treatment of rheumatoid arthritis. Bioorg Med Chem Lett 22:1655-9 (2012)  
Target
Name:
C-C chemokine receptor type 5
Synonyms:
C-C CKR-5 CC-CKR-5 CCR5 CCR5_HUMAN CHEMR13 HIV-1 fusion coreceptor
Type:
Enzyme
Mol. Mass.:
40540.21
Organism:
Homo sapiens (Human)
Description:
P51681
Residue:
352
  
Inhibitor
Name:
BDBM50364759
Synonyms:
CHEMBL1951897
Type:
Small organic molecule
Emp. Form.:
C31H46N4O5S2
Mol. Mass.:
618.851
SMILES:
CCN(C1CCN(CCC(N2CCN(CC2)S(=O)(=O)CC)c2ccccc2)CC1)C(=O)Cc1ccc(cc1)S(C)(=O)=O
: